BDBM50237967 CHEMBL4073185
SMILES COc1ccc(cc1)S(=O)(=O)Oc1ccc2c(C)cc(=O)oc2c1OS(=O)(=O)c1ccc(OC)cc1
InChI Key InChIKey=YEIJHMJCQKZXTN-UHFFFAOYSA-N
Data  1 IC50
  Tab Delimited (TSV)   2D SDfile   Computed 3D by Vconf -m prep SDfile
Find this compound or compounds like it in BindingDB:
Activity Spreadsheet -- Enzyme Inhibition Constant Data from BindingDB
Found 1 hit for monomerid = 50237967
TargetAlkaline phosphatase, tissue-nonspecific isozyme(Homo sapiens (Human))
University Of Karachi
Curated by ChEMBL
LigandPNGBDBM50237967(CHEMBL4073185)
Affinity DataIC50:  2.59E+3nM. Assay description: Inhibition of human TNAP using CDP-star as substrate pretreated for 10 mins followed by substrate addition measured after 10 mins by spectrophotometr...
In DepthDetails ArticlePubMed