BDBM50238154 CHEMBL321494
SMILES CSc1nc(c([nH]1)-c1ccnc(Nc2ccccc2)c1)-c1ccc(F)cc1
InChI Key InChIKey=KFULDVUYUMOVAX-UHFFFAOYSA-N
Data  8 IC50
  Tab Delimited (TSV)   2D SDfile   Computed 3D by Vconf -m prep SDfile
Find this compound or compounds like it in BindingDB:
Activity Spreadsheet -- Enzyme Inhibition Constant Data from BindingDB
Found 8 hits for monomerid = 50238154
TargetEpidermal growth factor receptor(Homo sapiens (Human))
Eberhard Karls University T£Bingen
Curated by ChEMBL
LigandPNGBDBM50238154(CHEMBL321494)
Affinity DataIC50:  24nM. Assay description: Inhibition of human N-terminal GST-fused EGFR cytoplasmic domain (669 to 1210 residues) expressed in baculovirus using TK-substrate-biotin preincubat...
In DepthDetails ArticlePubMed
TargetMitogen-activated protein kinase 11/12/13/14(Homo sapiens (Human))
Eberhard-Karls-University T£Bingen
Curated by ChEMBL
LigandPNGBDBM50238154(CHEMBL321494)
Affinity DataIC50:  340nM. Assay description: Inhibitory activity against TNF-alpha release in PBM cells
In DepthDetails ArticlePubMed
TargetMitogen-activated protein kinase 11/12/13/14(Homo sapiens (Human))
Eberhard-Karls-University T£Bingen
Curated by ChEMBL
LigandPNGBDBM50238154(CHEMBL321494)
Affinity DataIC50:  30nM. Assay description: Inhibitory activity against induction of IL-1-beta release in PBMCs
In DepthDetails ArticlePubMed
TargetEpidermal growth factor receptor(Homo sapiens (Human))
Eberhard Karls University T£Bingen
Curated by ChEMBL
LigandPNGBDBM50238154(CHEMBL321494)
Affinity DataIC50:  24nM. Assay description: Inhibition of wild type EGFR (unknown origin)
In DepthDetails PubMed
TargetPotassium voltage-gated channel subfamily H member 2(Homo sapiens (Human))
C-A-I-R Biosciences
Curated by ChEMBL
LigandPNGBDBM50238154(CHEMBL321494)
Affinity DataIC50:  2.76E+3nM. Assay description: Inhibition of human PDE4D3 expressed in sf9 cells
In DepthDetails ArticlePubMed
TargetEpidermal growth factor receptor(Homo sapiens (Human))
Eberhard Karls University T£Bingen
Curated by ChEMBL
LigandPNGBDBM50238154(CHEMBL321494)
Affinity DataIC50: >149nM. Assay description: Inhibition of EGFR L858R/T790M/C797S mutant (unknown origin)
In DepthDetails PubMed
TargetEpidermal growth factor receptor(Homo sapiens (Human))
Eberhard Karls University T£Bingen
Curated by ChEMBL
LigandPNGBDBM50238154(CHEMBL321494)
Affinity DataIC50:  130nM. Assay description: Inhibition of EGFR L858R/T790M mutant (unknown origin)
In DepthDetails PubMed
TargetMitogen-activated protein kinase 11/12/13/14(Homo sapiens (Human))
Eberhard-Karls-University T£Bingen
Curated by ChEMBL
LigandPNGBDBM50238154(CHEMBL321494)
Affinity DataIC50:  130nM. Assay description: Inhibitory activity against mitogen-activated protein kinase p38 at 10 e-4 to 10 e-8 M concentration
In DepthDetails ArticlePubMed