BDBM50238577 CHEMBL4096883
SMILES Cc1ccc(CNC(=O)n2c(N)nc3ccccc23)cc1
InChI Key InChIKey=ZXTXFWDTWHDSNX-UHFFFAOYSA-N
Data  1 IC50
  Tab Delimited (TSV)   2D SDfile   Computed 3D by Vconf -m prep SDfile
Find this compound or compounds like it in BindingDB:
Activity Spreadsheet -- Enzyme Inhibition Constant Data from BindingDB
Found 1 hit for monomerid = 50238577
TargetAcid ceramidase(Homo sapiens (Human))
Istituto Italiano Di Tecnologia
Curated by ChEMBL
LigandPNGBDBM50238577(CHEMBL4096883)
Affinity DataIC50:  7nM. Assay description: Inhibition of human C-terminal His-tagged acid ceramidase variant 1 expressed in HEK293 cells using fluorogenic substrate Rbm-14-12 preincubated for ...
In DepthDetails ArticlePubMed