BDBM50240365 2-(4,5-Dihydro-1H-imidazol-2-yl)-quinoline::2-(4,5-dihydro-1H-imidazol-2-yl)quinoline::CHEMBL13698
SMILES C1CN=C(N1)c1ccc2ccccc2n1
InChI Key InChIKey=OSUVWJGCKQEMHK-UHFFFAOYSA-N
Data  3 KI  2 IC50
  Tab Delimited (TSV)   2D SDfile   Computed 3D by Vconf -m prep SDfile
Find this compound or compounds like it in BindingDB:
Activity Spreadsheet -- Enzyme Inhibition Constant Data from BindingDB
Found 5 hits for monomerid = 50240365
TargetNischarin(Homo sapiens (Human))
Universit£
Curated by ChEMBL
LigandPNGBDBM50240365(2-(4,5-Dihydro-1H-imidazol-2-yl)-quinoline | 2-(4,...)
Affinity DataKi:  1.60nM. Assay description: Binding affinity for imidazoline receptor I-2 in rabbit kidney homogenate (relative to [3H]-Idazoxan radioligand)
In DepthDetails ArticlePubMed
TargetAmine oxidase [flavin-containing] A(Rattus norvegicus (rat))
Universidade Federal De Santa Maria
Curated by ChEMBL
LigandPNGBDBM50240365(2-(4,5-Dihydro-1H-imidazol-2-yl)-quinoline | 2-(4,...)
Affinity DataKi:  4.86E+3nM. Assay description: Binding affinity to MAOA imidazoline binding site in rat brain mitochondrial homogenate assessed as 4-hydroxyquinoline production by spectrophotometr...
In DepthDetails ArticlePubMed
TargetAmine oxidase [flavin-containing] B(Rattus norvegicus (rat))
Universidade Federal De Santa Maria
Curated by ChEMBL
LigandPNGBDBM50240365(2-(4,5-Dihydro-1H-imidazol-2-yl)-quinoline | 2-(4,...)
Affinity DataKi:  5.32E+3nM. Assay description: Binding affinity to MAOB imidazoline binding site in rat brain mitochondrial homogenate assessed as 4-hydroxyquinoline production by spectrophotometr...
In DepthDetails ArticlePubMed
TargetAmine oxidase [flavin-containing] B(Rattus norvegicus (rat))
Universidade Federal De Santa Maria
Curated by ChEMBL
LigandPNGBDBM50240365(2-(4,5-Dihydro-1H-imidazol-2-yl)-quinoline | 2-(4,...)
Affinity DataIC50:  1.33E+4nM. Assay description: Binding affinity to MAOB imidazoline binding site in rat brain mitochondrial homogenate assessed as 4-hydroxyquinoline production by spectrophotometr...
In DepthDetails ArticlePubMed
TargetAmine oxidase [flavin-containing] A(Rattus norvegicus (rat))
Universidade Federal De Santa Maria
Curated by ChEMBL
LigandPNGBDBM50240365(2-(4,5-Dihydro-1H-imidazol-2-yl)-quinoline | 2-(4,...)
Affinity DataIC50:  1.27E+4nM. Assay description: Binding affinity to MAOA imidazoline binding site in rat brain mitochondrial homogenate assessed as 4-hydroxyquinoline production by spectrophotometr...
In DepthDetails ArticlePubMed