BDBM50240495 (R)-1-(4-(pyrrolidine-1-carbonyl)thiazolidin-3-yl)octan-1-one::1-[(R)-4-(Pyrrolidine-1-carbonyl)-thiazolidin-3-yl]-octan-1-one::CHEMBL45594
SMILES CCCCCCCC(=O)N1CSC[C@H]1C(=O)N1CCCC1
InChI Key InChIKey=RDKPVMKQPKWFLZ-AWEZNQCLSA-N
Data  2 IC50
  Tab Delimited (TSV)   2D SDfile   Computed 3D by Vconf -m prep SDfile
Find this compound or compounds like it in BindingDB:
Activity Spreadsheet -- Enzyme Inhibition Constant Data from BindingDB
Found 2 hits for monomerid = 50240495
TargetProlyl endopeptidase(Rattus norvegicus)
TBA
Curated by ChEMBL
LigandPNGBDBM50240495((R)-1-(4-(pyrrolidine-1-carbonyl)thiazolidin-3-yl)...)
Affinity DataIC50:  11nM. Assay description: Inhibitory activity against rat brain Prolyl endopeptidase (PEP)
In DepthDetails Article
TargetProlyl endopeptidase(Rattus norvegicus)
TBA
Curated by ChEMBL
LigandPNGBDBM50240495((R)-1-(4-(pyrrolidine-1-carbonyl)thiazolidin-3-yl)...)
Affinity DataIC50:  11nM. Assay description: Inhibition of POP in Sprague-Dawley rat brain homogenates
In DepthDetails ArticlePubMed