BDBM50240587 CHEMBL4070316
SMILES [H][C@]12CC[C@H](N1C(=O)[C@@H](NC(=O)[C@H](CC)NC)[C@@H](CNC(=O)CCNC(=O)CN(Cc1ccccn1)Cc1ccccn1)CC2)C(=O)NC(c1ccccc1)c1ccccc1
InChI Key InChIKey=JTXRTFXANHGCBX-PZOHKCEOSA-N
Data  1 IC50
  Tab Delimited (TSV)   2D SDfile   Computed 3D by Vconf -m prep SDfile
Find this compound or compounds like it in BindingDB:
Activity Spreadsheet -- Enzyme Inhibition Constant Data from BindingDB
Found 1 hit for monomerid = 50240587
TargetBaculoviral IAP repeat-containing protein 2(Homo sapiens (Human))
Istituto Di Scienze E Tecnologie Molecolari (Istm)
Curated by ChEMBL
LigandPNGBDBM50240587(CHEMBL4070316)
Affinity DataIC50:  1.40nM. Assay description: Inhibition of SMAC derived peptide abuRPF-K(5-Fam)-NH2 interaction with recombinant human C-terminal 6His-tagged cIAP1 BIR3 domain (245 to 357 residu...
In DepthDetails ArticlePubMed