BDBM50240630 CHEMBL4102192
SMILES CC[C@H](C)[C@@H]1NC(=O)[C@H](Cc2ccc(O)cc2)NC(=O)CCSSC[C@H](NC(=O)[C@H](CC(N)=O)NC(=O)[C@H](CCC(N)=O)NC1=O)C(=O)N1CCC[C@H]1C(=O)N[C@@H](CC1CCCCC1)C(=O)NCC(N)=O
InChI Key InChIKey=QOSUQVBNAGEWTM-SQIBDWRESA-N
Data  3 EC50
  Tab Delimited (TSV)   2D SDfile   Computed 3D by Vconf -m prep SDfile
Find this compound or compounds like it in BindingDB:
Activity Spreadsheet -- Enzyme Inhibition Constant Data from BindingDB
Found 3 hits for monomerid = 50240630
TargetVasopressin V1a receptor(Homo sapiens (Human))
Takeda Pharmaceutical
Curated by ChEMBL
LigandPNGBDBM50240630(CHEMBL4102192)
Affinity DataEC50: >100nM. Assay description: Agonist activity at human V1a receptor expressed in CHO cells assessed as calcium mobilization measured after 30 mins by Fluo-4-AM dye based FLIPR as...
In DepthDetails ArticlePubMed
TargetOxytocin receptor(Homo sapiens (Human))
Takeda Pharmaceutical
Curated by ChEMBL
LigandPNGBDBM50240630(CHEMBL4102192)
Affinity DataEC50:  0.0100nM. Assay description: Agonist activity at human OTR expressed in CHO cells assessed as calcium mobilization measured after 30 mins by Fluo-4-AM dye based FLIPR assay
In DepthDetails ArticlePubMed
TargetVasopressin V1a receptor(Homo sapiens (Human))
Takeda Pharmaceutical
Curated by ChEMBL
LigandPNGBDBM50240630(CHEMBL4102192)
Affinity DataEC50:  1.40nM. Assay description: Agonist activity at human V1b receptor expressed in CHO cells assessed as calcium mobilization measured after 30 mins by Fluo-4-AM dye based FLIPR as...
In DepthDetails ArticlePubMed