BDBM50241205 CHEMBL1463512
SMILES Oc1nc2ccccc2nc1C(F)(F)F
InChI Key InChIKey=NOGLKXWLUDJZDQ-UHFFFAOYSA-N
Data  3 IC50  2 Kd
  Tab Delimited (TSV)   2D SDfile   Computed 3D by Vconf -m prep SDfile
Find this compound or compounds like it in BindingDB:
Activity Spreadsheet -- Enzyme Inhibition Constant Data from BindingDB
Found 2 hits for monomerid = 50241205
TargetKetohexokinase(Homo sapiens (Human))
Pfizer
Curated by ChEMBL
LigandPNGBDBM50241205(CHEMBL1463512)
Affinity DataKd:  4.40E+4nM. Assay description: Binding affinity to full length recombinant human biotin-labeled KHK by SPR assay
In DepthDetails ArticlePubMed
TargetKetohexokinase(Homo sapiens (Human))
Pfizer
Curated by ChEMBL
LigandPNGBDBM50241205(CHEMBL1463512)
Affinity DataKd:  4.40E+4nM. Assay description: Binding affinity to recombinant His-tagged human KHK expressed in Escherichia coli in presence of NADPH
In DepthDetails ArticlePubMed