BDBM50241790 CHEMBL4081018
SMILES Cl.NC[C@@H]1OB(O)c2c1c(Cl)cc1OCCOc21
InChI Key InChIKey=KESLJBNLRWXDQV-FJXQXJEOSA-N
Data  1 IC50
  Tab Delimited (TSV)   2D SDfile   Computed 3D by Vconf -m prep SDfile
Find this compound or compounds like it in BindingDB:
Activity Spreadsheet -- Enzyme Inhibition Constant Data from BindingDB
Found 1 hit for monomerid = 50241790
TargetLeucine--tRNA ligase(Mycobacterium tuberculosis (strain ATCC 25618 / H3...)
Anacor Pharmaceuticals
Curated by ChEMBL
LigandPNGBDBM50241790(CHEMBL4081018)
Affinity DataIC50:  1.26E+4nM. Assay description: Inhibition of Mycobacterium tuberculosis H37Rv N-terminal 6His-tagged LeuRS expressed in Escherichia coli BL21(DE3) assessed as L-[14C]leucine incorp...
In DepthDetails ArticlePubMed