BDBM50241858 CHEMBL4070459
SMILES Cn1cc(cn1)-c1ccncc1\C=C\C(=O)Nc1ccc(CN2C3CCC2COC3)cc1
InChI Key InChIKey=MRSAAOGDVNDADH-RUDMXATFSA-N
Data  1 IC50  1 EC50
  Tab Delimited (TSV)   2D SDfile   Computed 3D by Vconf -m prep SDfile
Find this compound or compounds like it in BindingDB:
Activity Spreadsheet -- Enzyme Inhibition Constant Data from BindingDB
Found 2 hits for monomerid = 50241858
TargetCyclin-dependent kinase 8(Homo sapiens (Human))
Takeda Pharmaceutical
Curated by ChEMBL
LigandPNGBDBM50241858(CHEMBL4070459)
Affinity DataEC50:  17nM. Assay description: Inhibition of [3H]WIN-35428l binding to Dopamine transporter
In DepthDetails ArticlePubMed
TargetCyclin-C(Homo sapiens (Human))
Takeda Pharmaceutical
Curated by ChEMBL
LigandPNGBDBM50241858(CHEMBL4070459)
Affinity DataIC50:  6.30nM. Assay description: Inhibition of kinase tracer 236 binding to full length N terminal GST-tagged human CDK8 (1 to 464 end residues) /CycC ( 1 to 283 end residues) expres...
In DepthDetails ArticlePubMed