BDBM50241860 CHEMBL4079977
SMILES O=C(Nc1ccc(CN2CC3CC(C2)O3)cc1)\C=C\c1cnccc1-c1cnn(c1)C1CC1
InChI Key InChIKey=IKRSLQINMKBFSM-FPYGCLRLSA-N
Data  1 IC50  1 EC50
  Tab Delimited (TSV)   2D SDfile   Computed 3D by Vconf -m prep SDfile
Find this compound or compounds like it in BindingDB:
Activity Spreadsheet -- Enzyme Inhibition Constant Data from BindingDB
Found 2 hits for monomerid = 50241860
TargetCyclin-dependent kinase 8(Homo sapiens (Human))
Takeda Pharmaceutical
Curated by ChEMBL
LigandPNGBDBM50241860(CHEMBL4079977)
Affinity DataEC50:  5.5nM. Assay description: Inhibition of CDK8 in human SW480 cells assessed as reduction in IFN-gamma induced STAT1 phosphorylation at Ser727 residues preincubated for 2 hrs fo...
In DepthDetails ArticlePubMed
TargetCyclin-C(Homo sapiens (Human))
Takeda Pharmaceutical
Curated by ChEMBL
LigandPNGBDBM50241860(CHEMBL4079977)
Affinity DataIC50:  6.70nM. Assay description: Inhibition of kinase tracer 236 binding to full length N terminal GST-tagged human CDK8 (1 to 464 end residues) /CycC ( 1 to 283 end residues) expres...
In DepthDetails ArticlePubMed