BDBM50241870 CHEMBL4094902
SMILES O=C(Nc1ccc(CN2CCOCC2)cc1)\C=C\c1cnccc1-c1cnsc1
InChI Key InChIKey=WWGYFGUZQDCDTE-ZZXKWVIFSA-N
Data  1 IC50  1 EC50
  Tab Delimited (TSV)   2D SDfile   Computed 3D by Vconf -m prep SDfile
Find this compound or compounds like it in BindingDB:
Activity Spreadsheet -- Enzyme Inhibition Constant Data from BindingDB
Found 2 hits for monomerid = 50241870
TargetCyclin-C(Homo sapiens (Human))
Takeda Pharmaceutical
Curated by ChEMBL
LigandPNGBDBM50241870(CHEMBL4094902)
Affinity DataIC50:  27nM. Assay description: Inhibition of kinase tracer 236 binding to full length N terminal GST-tagged human CDK8 (1 to 464 end residues) /CycC ( 1 to 283 end residues) expres...
In DepthDetails ArticlePubMed
TargetCyclin-dependent kinase 8(Homo sapiens (Human))
Takeda Pharmaceutical
Curated by ChEMBL
LigandPNGBDBM50241870(CHEMBL4094902)
Affinity DataEC50:  110nM. Assay description: Inhibition of CDK8 in human SW480 cells assessed as reduction in IFN-gamma induced STAT1 phosphorylation at Ser727 residues preincubated for 2 hrs fo...
In DepthDetails ArticlePubMed