BDBM50241885 CHEMBL4060759
SMILES Fc1cncc(\C=C\C(=O)Nc2ccc(CN3CCOCC3)cc2)c1-c1cnn(c1)C1CC1
InChI Key InChIKey=SPFRZBQLMQBEJM-FPYGCLRLSA-N
Data  1 IC50  1 EC50
  Tab Delimited (TSV)   2D SDfile   Computed 3D by Vconf -m prep SDfile
Find this compound or compounds like it in BindingDB:
Activity Spreadsheet -- Enzyme Inhibition Constant Data from BindingDB
Found 2 hits for monomerid = 50241885
TargetCyclin-C(Homo sapiens (Human))
Takeda Pharmaceutical
Curated by ChEMBL
LigandPNGBDBM50241885(CHEMBL4060759)
Affinity DataIC50:  6.5nM. Assay description: Inhibition of kinase tracer 236 binding to full length N terminal GST-tagged human CDK8 (1 to 464 end residues) /CycC ( 1 to 283 end residues) expres...
In DepthDetails ArticlePubMed
TargetCyclin-dependent kinase 8(Homo sapiens (Human))
Takeda Pharmaceutical
Curated by ChEMBL
LigandPNGBDBM50241885(CHEMBL4060759)
Affinity DataEC50:  2.30nM. Assay description: Inhibition of CDK8 in human SW480 cells assessed as reduction in IFN-gamma induced STAT1 phosphorylation at Ser727 residues preincubated for 2 hrs fo...
In DepthDetails ArticlePubMed