BDBM50241956 (3S,4aR,6aR,6bS,8aR,11R,12S,12aR,14aR,14bR)-4,4,6a,6b,8a,11,12,14b-octamethyl-1,2,3,4,4a,5,6,6a,6b,7,8,8a,9,10,11,12,12a,14,14a,14b-icosahydropicen-3-ol::CHEMBL455357::US11660306, Example amyrin::alpha-amyrin::urs-12-en-3beta-ol
SMILES C[C@@H]1CC[C@]2(C)CC[C@]3(C)C(=CC[C@@H]4[C@@]5(C)CC[C@H](O)C(C)(C)[C@@H]5CC[C@@]34C)[C@@H]2[C@H]1C
InChI Key InChIKey=FSLPMRQHCOLESF-SFMCKYFRSA-N
Data  2 KI  5 IC50  1 EC50
  Tab Delimited (TSV)   2D SDfile   Computed 3D by Vconf -m prep SDfile
Find this compound or compounds like it in BindingDB:
Activity Spreadsheet -- Enzyme Inhibition Constant Data from BindingDB
Found 5 hits for monomerid = 50241956
TargetDNA topoisomerase 1(Homo sapiens (Human))
Stephen F. Austin State University
Curated by ChEMBL
LigandPNGBDBM50241956((3S,4aR,6aR,6bS,8aR,11R,12S,12aR,14aR,14bR)-4,4,6a...)
Affinity DataIC50: >2.50E+5nM. Assay description: Inhibition of human DNA topoisomerase 1-mediated relaxation of supercoiled DNA by gel electrophoresis
In DepthDetails ArticlePubMed
TargetPolyunsaturated fatty acid 5-lipoxygenase(Homo sapiens (Human))
Osaka University
Curated by ChEMBL
LigandPNGBDBM50241956((3S,4aR,6aR,6bS,8aR,11R,12S,12aR,14aR,14bR)-4,4,6a...)
Affinity DataIC50: >4.00E+4nM. Assay description: Inhibition of human recombinant 5-LOX expressed in insect cells assessed as decrease in production of 5-HPETE and 5-HETE using arachidonic acid as su...
In DepthDetails ArticlePubMed
TargetPolyunsaturated fatty acid 5-lipoxygenase(Homo sapiens (Human))
Osaka University
Curated by ChEMBL
LigandPNGBDBM50241956((3S,4aR,6aR,6bS,8aR,11R,12S,12aR,14aR,14bR)-4,4,6a...)
Affinity DataIC50: >4.00E+4nM. Assay description: Inhibition of human recombinant 5-LOX expressed in insect cells assessed as decrease in production of 5-HPETE and 5-HETE using arachidonic acid as su...
In DepthDetails ArticlePubMed
TargetDNA topoisomerase 2-alpha(Homo sapiens (Human))
Stephen F. Austin State University
Curated by ChEMBL
LigandPNGBDBM50241956((3S,4aR,6aR,6bS,8aR,11R,12S,12aR,14aR,14bR)-4,4,6a...)
Affinity DataIC50: >2.50E+5nM. Assay description: Inhibition of human DNA topoisomerase 2-mediated relaxation of supercoiled DNA by gel electrophoresis
In DepthDetails ArticlePubMed
TargetTyrosine-protein phosphatase non-receptor type 1(Homo sapiens (Human))
Fudan University
Curated by ChEMBL
LigandPNGBDBM50241956((3S,4aR,6aR,6bS,8aR,11R,12S,12aR,14aR,14bR)-4,4,6a...)
Affinity DataIC50:  1.93E+4nM. Assay description: Compound is evaluated for the inhibition of porcine plasma Angiotensin I converting enzyme
In DepthDetails ArticlePubMed