BDBM50242891 CHEMBL4095768
SMILES CN(C)C1CCCN(C1)C(=O)c1cc(OCc2cc(C)no2)n(n1)-c1ccc(cc1)C#N
InChI Key InChIKey=CFTSISKJVGZBFM-UHFFFAOYSA-N
Data  1 IC50  1 Kd
  Tab Delimited (TSV)   2D SDfile   Computed 3D by Vconf -m prep SDfile
Find this compound or compounds like it in BindingDB:
Activity Spreadsheet -- Enzyme Inhibition Constant Data from BindingDB
Found 2 hits for monomerid = 50242891
TargetLysine-specific histone demethylase 1A(Homo sapiens (Human))
University Of Manchester
Curated by ChEMBL
LigandPNGBDBM50242891(CHEMBL4095768)
Affinity DataKd:  87nM. Assay description: Reversible inhibition of human recombinant N-terminal truncated LSD1 (151 to 852 residues) expressed in Escherichia coli by SPR analysis
In DepthDetails ArticlePubMed
TargetLysine-specific histone demethylase 1A(Homo sapiens (Human))
University Of Manchester
Curated by ChEMBL
LigandPNGBDBM50242891(CHEMBL4095768)
Affinity DataIC50:  650nM. Assay description: Inhibition of human recombinant N-terminal truncated LSD1 (151 to 852 residues) expressed in Escherichia coli using Histone H3(1 to 21)K4(Me1) biotin...
In DepthDetails ArticlePubMed