BDBM50242905 CHEMBL4103503
SMILES Cc1nc(COc2cc(nn2-c2ccc(cc2)C#N)C(=O)N2CCC[C@@H](N)C2)no1
InChI Key InChIKey=BINMIFARNCTJDS-OAHLLOKOSA-N
Data  2 IC50  1 Kd
  Tab Delimited (TSV)   2D SDfile   Computed 3D by Vconf -m prep SDfile
Find this compound or compounds like it in BindingDB:
Activity Spreadsheet -- Enzyme Inhibition Constant Data from BindingDB
Found 3 hits for monomerid = 50242905
TargetLysine-specific histone demethylase 1A(Homo sapiens (Human))
University Of Manchester
Curated by ChEMBL
LigandPNGBDBM50242905(CHEMBL4103503)
Affinity DataIC50:  190nM. Assay description: Inhibition of Fibrinogen receptor binding
In DepthDetails ArticlePubMed
TargetLysine-specific histone demethylase 1A(Homo sapiens (Human))
University Of Manchester
Curated by ChEMBL
LigandPNGBDBM50242905(CHEMBL4103503)
Affinity DataIC50:  420nM. Assay description: Inhibition of LSD1 in human THP1 cells assessed as upregulation of CD86 levels by ELISA
In DepthDetails ArticlePubMed
TargetLysine-specific histone demethylase 1A(Homo sapiens (Human))
University Of Manchester
Curated by ChEMBL
LigandPNGBDBM50242905(CHEMBL4103503)
Affinity DataKd:  34nM. Assay description: Reversible inhibition of human recombinant N-terminal truncated LSD1 (151 to 852 residues) expressed in Escherichia coli by SPR analysis
In DepthDetails ArticlePubMed