BDBM50243168 4-[(2R)-2-{[(2R)-2-(3-Chlorophenyl)-2-hydroxyethyl]amino}propyl]-4-biphenylcarboxylic acid::CHEMBL488430
SMILES C[C@H](Cc1ccc(cc1)-c1ccc(cc1)C(O)=O)NC[C@H](O)c1cccc(Cl)c1
InChI Key InChIKey=UDSXXZFTNZSJDL-MWTRTKDXSA-N
Data  2 EC50
  Tab Delimited (TSV)   2D SDfile   Computed 3D by Vconf -m prep SDfile
Find this compound or compounds like it in BindingDB:
Activity Spreadsheet -- Enzyme Inhibition Constant Data from BindingDB
Found 2 hits for monomerid = 50243168
TargetBeta-1 adrenergic receptor(Homo sapiens (Human))
Astellas Pharma
Curated by ChEMBL
LigandPNGBDBM50243168(4-[(2R)-2-{[(2R)-2-(3-Chlorophenyl)-2-hydroxyethyl...)
Affinity DataEC50:  13nM. Assay description: Agonist activity at human recombinant beta-1 adrenergic receptor expressed in CHO cells assessed as cAMP accumulation by enzyme immuno assay
In DepthDetails ArticlePubMed
TargetBeta-3 adrenergic receptor(Homo sapiens (Human))
Astellas Pharma
Curated by ChEMBL
LigandPNGBDBM50243168(4-[(2R)-2-{[(2R)-2-(3-Chlorophenyl)-2-hydroxyethyl...)
Affinity DataEC50:  0.180nM. Assay description: Agonist activity at human recombinant beta3 adrenergic receptor expressed in CHO cells assessed as cAMP accumulation by enzyme immuno assay
In DepthDetails ArticlePubMed