BDBM50243917 (2S,3S)-2-amino-3-(3-(2-chloro-4-(methylsulfonyl)phenyl)-1,2,4-oxadiazol-5-yl)-1-((S)-3-fluoropyrrolidin-1-yl)butan-1-one::CHEMBL488469
SMILES C[C@@H]([C@H](N)C(=O)N1CC[C@H](F)C1)c1nc(no1)-c1ccc(cc1Cl)S(C)(=O)=O
InChI Key InChIKey=IAGPOWLWJPTTOM-BHDSKKPTSA-N
Data  2 IC50
  Tab Delimited (TSV)   2D SDfile   Computed 3D by Vconf -m prep SDfile
Find this compound or compounds like it in BindingDB:
Activity Spreadsheet -- Enzyme Inhibition Constant Data from BindingDB
Found 2 hits for monomerid = 50243917
TargetDipeptidyl peptidase 8(Homo sapiens (Human))
Merck Research Laboratories
Curated by ChEMBL
LigandPNGBDBM50243917((2S,3S)-2-amino-3-(3-(2-chloro-4-(methylsulfonyl)p...)
Affinity DataIC50: >1.00E+5nM. Assay description: Inhibition of DPP8 (unknown origin)
In DepthDetails ArticlePubMed
TargetDipeptidyl peptidase 4(Homo sapiens (Human))
Merck Research Laboratories
Curated by ChEMBL
LigandPNGBDBM50243917((2S,3S)-2-amino-3-(3-(2-chloro-4-(methylsulfonyl)p...)
Affinity DataIC50:  40nM. Assay description: Inhibition of DPP4 (unknown origin)
In DepthDetails ArticlePubMed