BDBM50243966 (R)-4-((R)-3-amino-4-(2-fluorophenyl)butanoyl)-3-methyl-1,4-diazepan-2-one::CHEMBL452805
SMILES C[C@H]1N(CCCNC1=O)C(=O)C[C@H](N)Cc1ccccc1F
InChI Key InChIKey=XPWMTOHYUFNJOG-DGCLKSJQSA-N
Data  2 IC50
  Tab Delimited (TSV)   2D SDfile   Computed 3D by Vconf -m prep SDfile
Find this compound or compounds like it in BindingDB:
Activity Spreadsheet -- Enzyme Inhibition Constant Data from BindingDB
Found 2 hits for monomerid = 50243966
TargetDipeptidyl peptidase 8(Homo sapiens (Human))
Merck Research Laboratories
Curated by ChEMBL
LigandPNGBDBM50243966((R)-4-((R)-3-amino-4-(2-fluorophenyl)butanoyl)-3-m...)
Affinity DataIC50:  8.70E+4nM. Assay description: Inhibition of DPP8 (unknown origin)
In DepthDetails ArticlePubMed
TargetDipeptidyl peptidase 4(Homo sapiens (Human))
Merck Research Laboratories
Curated by ChEMBL
LigandPNGBDBM50243966((R)-4-((R)-3-amino-4-(2-fluorophenyl)butanoyl)-3-m...)
Affinity DataIC50:  40nM. Assay description: Inhibition of DPP4 (unknown origin)
In DepthDetails ArticlePubMed