BDBM50246117 CHEMBL4074169
SMILES [H][C@@]1(C[C@H](NC(=O)COCCOCCNC(=S)Nc2ccc3c(c2)C(=O)OC32c3ccc(O)cc3Oc3cc(O)ccc23)C(=O)NCC(=O)N[C@@]2(C)CCCCCCCCCCCC[C@](C)(NC(=O)[C@H](CC(O)=O)NC(=O)[C@H](CC(C)C)NC2=O)C(=O)N[C@@H](CC(C)C)C(=O)N[C@@H](CC(O)=O)C(=O)N[C@@H](CC(C)C)C(=O)N[C@@H](C)C(=O)N[C@@H](CO)C(N)=O)CNc2ccccc12
InChI Key InChIKey=YSZRWSHYBFBSDN-GWAKEKJKSA-N
Data  1 Kd
  Tab Delimited (TSV)   2D SDfile   Computed 3D by Vconf -m prep SDfile
Find this compound or compounds like it in BindingDB:
Activity Spreadsheet -- Enzyme Inhibition Constant Data from BindingDB
Found 1 hit for monomerid = 50246117
Target14-3-3 protein zeta/delta(Homo sapiens)
Chemical Genomics Centre of The Max Planck Society
Curated by ChEMBL
LigandPNGBDBM50246117(CHEMBL4074169)
Affinity DataKd: >2.00E+4nM. Assay description: Binding affinity to 14-3-3zeta (1 to 230 residues) (unknown origin) after 1 hr using FITC labeled compound by fluorescence polarization assay
In DepthDetails ArticlePubMed