BDBM50247972 (R)-2-hydroxy-N,N-dimethyl-3-(4-(1-(4-methylfuran-2-yl)propylamino)-1,2,5-thiadiazol-3-ylamino)benzamide::CHEMBL455209
SMILES CC[C@@H](Nc1nsnc1Nc1cccc(C(=O)N(C)C)c1O)c1cc(C)co1
InChI Key InChIKey=MJPRWHQXMDLDCM-CYBMUJFWSA-N
Data  2 KI
  Tab Delimited (TSV)   2D SDfile   Computed 3D by Vconf -m prep SDfile
Find this compound or compounds like it in BindingDB:
Activity Spreadsheet -- Enzyme Inhibition Constant Data from BindingDB
Found 2 hits for monomerid = 50247972
TargetC-X-C chemokine receptor type 1(Homo sapiens (Human))
Schering-Plough Research Institute
Curated by ChEMBL
LigandPNGBDBM50247972((R)-2-hydroxy-N,N-dimethyl-3-(4-(1-(4-methylfuran-...)
Affinity DataKi:  35nM. Assay description: Displacement of IL8 from CXCR1 receptor (unknown origin)
In DepthDetails ArticlePubMed
TargetC-X-C chemokine receptor type 2(Homo sapiens (Human))
Schering-Plough Research Institute
Curated by ChEMBL
LigandPNGBDBM50247972((R)-2-hydroxy-N,N-dimethyl-3-(4-(1-(4-methylfuran-...)
Affinity DataKi:  2.28E+3nM. Assay description: Displacement of IL8 from CXCR2 receptor (unknown origin)
In DepthDetails ArticlePubMed