BDBM50248113 (R)-N-(2-cyanoethyl)-3-(4-(2,2-dimethyl-1-(5-methylfuran-2-yl)propylamino)-1,2,5-thiadiazol-3-ylamino)-2-hydroxy-N-methylbenzamide::CHEMBL462155
SMILES CN(CCC#N)C(=O)c1cccc(Nc2nsnc2N[C@@H](c2ccc(C)o2)C(C)(C)C)c1O
InChI Key InChIKey=LUNAFTMLJLEOEQ-IBGZPJMESA-N
Data  2 KI
  Tab Delimited (TSV)   2D SDfile   Computed 3D by Vconf -m prep SDfile
Find this compound or compounds like it in BindingDB:
Activity Spreadsheet -- Enzyme Inhibition Constant Data from BindingDB
Found 2 hits for monomerid = 50248113
TargetC-X-C chemokine receptor type 1(Homo sapiens (Human))
Schering-Plough Research Institute
Curated by ChEMBL
LigandPNGBDBM50248113((R)-N-(2-cyanoethyl)-3-(4-(2,2-dimethyl-1-(5-methy...)
Affinity DataKi:  13nM. Assay description: Displacement of IL8 from CXCR1 receptor (unknown origin)
In DepthDetails ArticlePubMed
TargetC-X-C chemokine receptor type 2(Homo sapiens (Human))
Schering-Plough Research Institute
Curated by ChEMBL
LigandPNGBDBM50248113((R)-N-(2-cyanoethyl)-3-(4-(2,2-dimethyl-1-(5-methy...)
Affinity DataKi:  114nM. Assay description: Displacement of IL8 from CXCR2 receptor (unknown origin)
In DepthDetails ArticlePubMed