BDBM50248402 (S)-3-(2-(2,2-difluoro-1-(3-methylfuran-2-yl)propylamino)-3,4-dioxocyclobut-1-enylamino)-2-hydroxy-N,N-dimethylbenzamide::CHEMBL491506
SMILES CN(C)C(=O)c1cccc(Nc2c(N[C@@H](c3occc3C)C(C)(F)F)c(=O)c2=O)c1O
InChI Key InChIKey=DABXGLPZDQYKGO-IBGZPJMESA-N
Data  2 KI
  Tab Delimited (TSV)   2D SDfile   Computed 3D by Vconf -m prep SDfile
Find this compound or compounds like it in BindingDB:
Activity Spreadsheet -- Enzyme Inhibition Constant Data from BindingDB
Found 2 hits for monomerid = 50248402
TargetC-X-C chemokine receptor type 2(Homo sapiens (Human))
Schering-Plough Research Institute
Curated by ChEMBL
LigandPNGBDBM50248402((S)-3-(2-(2,2-difluoro-1-(3-methylfuran-2-yl)propy...)
Affinity DataKi:  12nM. Assay description: Binding affinity to CXCR2 (unknown origin)
In DepthDetails ArticlePubMed
TargetC-X-C chemokine receptor type 1(Homo sapiens (Human))
Schering-Plough Research Institute
Curated by ChEMBL
LigandPNGBDBM50248402((S)-3-(2-(2,2-difluoro-1-(3-methylfuran-2-yl)propy...)
Affinity DataKi:  30nM. Assay description: Binding affinity to CXCR1 (unknown origin)
In DepthDetails ArticlePubMed