BDBM50248455 (S)-3-(2-(2-fluoro-2-methyl-1-(5-methylfuran-2-yl)propylamino)-3,4-dioxocyclobut-1-enylamino)-2-hydroxy-N,N-dimethylbenzamide::CHEMBL491487
SMILES CN(C)C(=O)c1cccc(Nc2c(N[C@@H](c3ccc(C)o3)C(C)(C)F)c(=O)c2=O)c1O
InChI Key InChIKey=DDMTYZBTPDHBMN-FQEVSTJZSA-N
Data  2 KI
  Tab Delimited (TSV)   2D SDfile   Computed 3D by Vconf -m prep SDfile
Find this compound or compounds like it in BindingDB:
Activity Spreadsheet -- Enzyme Inhibition Constant Data from BindingDB
Found 2 hits for monomerid = 50248455
TargetC-X-C chemokine receptor type 2(Homo sapiens (Human))
Schering-Plough Research Institute
Curated by ChEMBL
LigandPNGBDBM50248455((S)-3-(2-(2-fluoro-2-methyl-1-(5-methylfuran-2-yl)...)
Affinity DataKi:  8nM. Assay description: Binding affinity to CXCR2 (unknown origin)
In DepthDetails ArticlePubMed
TargetC-X-C chemokine receptor type 1(Homo sapiens (Human))
Schering-Plough Research Institute
Curated by ChEMBL
LigandPNGBDBM50248455((S)-3-(2-(2-fluoro-2-methyl-1-(5-methylfuran-2-yl)...)
Affinity DataKi:  24nM. Assay description: Binding affinity to CXCR1 (unknown origin)
In DepthDetails ArticlePubMed