BDBM50249133 CHEMBL4074153
SMILES CCOC(=O)C1=C(N)n2n(C1c1ccccc1O)c(=O)ccc2=O
InChI Key InChIKey=IJKTZMQKLGUFEI-UHFFFAOYSA-N
Data  2 IC50
  Tab Delimited (TSV)   2D SDfile   Computed 3D by Vconf -m prep SDfile
Find this compound or compounds like it in BindingDB:
Activity Spreadsheet -- Enzyme Inhibition Constant Data from BindingDB
Found 2 hits for monomerid = 50249133
TargetProstaglandin G/H synthase 1(Homo sapiens (Human))
Suez Canal University
Curated by ChEMBL
LigandPNGBDBM50249133(CHEMBL4074153)
Affinity DataIC50:  74nM. Assay description: Inhibition of COX1 (unknown origin) using arachidonic acid as substrate pretreated for 10 mins followed by substrate addition measured after 2 mins b...
In DepthDetails ArticlePubMed
TargetProstaglandin G/H synthase 2(Homo sapiens (Human))
Suez Canal University
Curated by ChEMBL
LigandPNGBDBM50249133(CHEMBL4074153)
Affinity DataIC50:  90nM. Assay description: Inhibition of COX2 (unknown origin) using arachidonic acid as substrate pretreated for 10 mins followed by substrate addition measured after 2 mins b...
In DepthDetails ArticlePubMed