BDBM50253871 CHEMBL4097126
SMILES NS(=O)(=O)c1ccc(NC(=S)N\N=C2/C(=O)Nc3ccc(cc23)[N+]([O-])=O)cc1
InChI Key InChIKey=BOGXPRGLPHYWOZ-UHFFFAOYSA-N
Data  4 KI
  Tab Delimited (TSV)   2D SDfile   Computed 3D by Vconf -m prep SDfile
Find this compound or compounds like it in BindingDB:
Activity Spreadsheet -- Enzyme Inhibition Constant Data from BindingDB
Found 4 hits for monomerid = 50253871
TargetCarbonic anhydrase-related protein 11(Homo sapiens)
Istanbul University
Curated by ChEMBL
LigandPNGBDBM50253871(CHEMBL4097126)
Affinity DataKi:  4.10nM. Assay description: Inhibition of recombinant human membrane bound carbonic anhydrase 11 expressed in Escherichia coli pretreated for 15 mins prior to testing by stopped...
In DepthDetails ArticlePubMed
TargetCarbonic anhydrase 9(Homo sapiens (Human))
Istanbul University
Curated by ChEMBL
LigandPNGBDBM50253871(CHEMBL4097126)
Affinity DataKi:  20nM. Assay description: Inhibition of recombinant human membrane bound carbonic anhydrase 9 expressed in Escherichia coli pretreated for 15 mins prior to testing by stopped-...
In DepthDetails ArticlePubMed
TargetCarbonic anhydrase 2(Homo sapiens (Human))
Istanbul University
Curated by ChEMBL
LigandPNGBDBM50253871(CHEMBL4097126)
Affinity DataKi:  32nM. Assay description: Inhibition of recombinant human cytosolic carbonic anhydrase 2 expressed in Escherichia coli pretreated for 15 mins prior to testing by stopped-flow ...
In DepthDetails ArticlePubMed
TargetCarbonic anhydrase 1(Homo sapiens (Human))
Istanbul University
Curated by ChEMBL
LigandPNGBDBM50253871(CHEMBL4097126)
Affinity DataKi:  69nM. Assay description: Inhibition of recombinant human cytosolic carbonic anhydrase 1 expressed in Escherichia coli pretreated for 15 mins prior to testing by stopped-flow ...
In DepthDetails ArticlePubMed