BDBM50253886 CHEMBL4077583
SMILES ONC(=O)CCCCCCCOc1ccccc1C(=O)Nc1ncnc2[nH]cnc12
InChI Key InChIKey=AZBPOTYBYHEXEU-UHFFFAOYSA-N
Data  2 IC50
  Tab Delimited (TSV)   2D SDfile   Computed 3D by Vconf -m prep SDfile
Find this compound or compounds like it in BindingDB:
Activity Spreadsheet -- Enzyme Inhibition Constant Data from BindingDB
Found 2 hits for monomerid = 50253886
TargetBromodomain-containing protein 4(Homo sapiens (Human))
The University of Tokyo
Curated by ChEMBL
LigandPNGBDBM50253886(CHEMBL4077583)
Affinity DataIC50:  7.40E+3nM. Assay description: Inhibition of recombinant human N-terminal His-tagged BRD4 bromodomain 1 (49 to 170 residues) expressed in Escherichia coli using biotinylated peptid...
In DepthDetails ArticlePubMed
TargetBromodomain-containing protein 4(Homo sapiens (Human))
The University of Tokyo
Curated by ChEMBL
LigandPNGBDBM50253886(CHEMBL4077583)
Affinity DataIC50:  5.70E+3nM. Assay description: Inhibition of BRD4 in human HL60 cells assessed as reduction in C-myc production after 24 hrs by ELISA
In DepthDetails ArticlePubMed