BDBM50253887 CHEMBL4076445
SMILES ONC(=O)CCCOc1ccccc1C(=O)Nc1ncnc2[nH]cnc12
InChI Key InChIKey=UGORVKFJJNGIEH-UHFFFAOYSA-N
Data  1 IC50
  Tab Delimited (TSV)   2D SDfile   Computed 3D by Vconf -m prep SDfile
Find this compound or compounds like it in BindingDB:
Activity Spreadsheet -- Enzyme Inhibition Constant Data from BindingDB
Found 1 hit for monomerid = 50253887
TargetBromodomain-containing protein 4(Homo sapiens (Human))
The University of Tokyo
Curated by ChEMBL
LigandPNGBDBM50253887(CHEMBL4076445)
Affinity DataIC50:  2.50E+4nM. Assay description: Inhibition of recombinant human N-terminal His-tagged BRD4 bromodomain 1 (49 to 170 residues) expressed in Escherichia coli using biotinylated peptid...
In DepthDetails ArticlePubMed