BDBM50254060 CHEMBL4061379
SMILES CC[C@H](C)[C@H](NC(=O)[C@H](CCCNC(N)=N)NC(=O)[C@H](CC(O)=O)NC(=O)[C@@H](NC(=O)[C@@H]1CCCN1C(=O)CNC(=O)[C@@H](C)NC(=O)[C@H](CC1CCCCC1)NC(=O)[C@H]1CCCN1C(=O)[C@H](CO)NC(=O)[C@@H](Cc1ccccc1)NC(C)=O)[C@@H](C)CC)C(=O)NC
InChI Key InChIKey=SCMCOEBTJBQKBS-KAERUQQXSA-N
Data  2 IC50
  Tab Delimited (TSV)   2D SDfile   Computed 3D by Vconf -m prep SDfile
Find this compound or compounds like it in BindingDB:
Activity Spreadsheet -- Enzyme Inhibition Constant Data from BindingDB
Found 2 hits for monomerid = 50254060
TargetAtrial natriuretic peptide receptor 3(Homo sapiens (Human))
Takeda Pharmaceutical
Curated by ChEMBL
LigandPNGBDBM50254060(CHEMBL4061379)
Affinity DataIC50:  0.0870nM. Assay description: Displacement of [125I]-human ANP from His-tagged and Fc fragment containing human NPR-3 extracellular domain expressed in FreeStyle 293 cells incubat...
In DepthDetails ArticlePubMed
TargetAtrial natriuretic peptide receptor 1(Homo sapiens (Human))
Takeda Pharmaceutical
Curated by ChEMBL
LigandPNGBDBM50254060(CHEMBL4061379)
Affinity DataIC50: >1.00E+3nM. Assay description: Displacement of [125I]-human ANP from human NPR-1 incubated for 2 hrs by top count method
In DepthDetails ArticlePubMed