BDBM50259297 CHEMBL4062085
SMILES Nc1nc(Br)cn2cc(nc12)-c1ccccc1
InChI Key InChIKey=VWNNBVHXUZBHNY-UHFFFAOYSA-N
Data  1 KI
  Tab Delimited (TSV)   2D SDfile   Computed 3D by Vconf -m prep SDfile
Find this compound or compounds like it in BindingDB:
Activity Spreadsheet -- Enzyme Inhibition Constant Data from BindingDB
Found 1 hit for monomerid = 50259297
TargetAdenosine receptor A1(Homo sapiens (Human))
Universita Degli Studi Di Firenze
Curated by ChEMBL
LigandPNGBDBM50259297(CHEMBL4062085)
Affinity DataKi:  420nM. Assay description: Displacement of [3H]DPCPX from human adenosine A1 receptor expressed in CHO cell membranes after 120 mins by scintillation counting method
In DepthDetails ArticlePubMed