BDBM50262119 CHEMBL4097408
SMILES CCCCCCCCCCCCCCCC(=O)NC[C@H]1CC[C@@H](CC1)C(=O)N[C@@H](CCC(=O)NCCCOCCOCCOCCCNC(=O)COCC(=O)N[C@@H](Cc1ccc(O)cc1)C(=O)N[C@@H](Cc1ccc2ccccc2c1)C(=O)N[C@@H](CC(C)C)C(=O)N[C@@H](Cc1ccccc1)C(=O)N[C@@H](CCCNC(N)=N)C(=O)N1CCC[C@H]1C(=O)N[C@@H](CCCNC(N)=N)C(=O)N[C@@H](CC(N)=O)C(O)=O)C(O)=O
InChI Key InChIKey=KZVAPEDXJIAWSS-KEDSPCRTSA-N
Data  4 EC50
  Tab Delimited (TSV)   2D SDfile   Computed 3D by Vconf -m prep SDfile
Find this compound or compounds like it in BindingDB:
Activity Spreadsheet -- Enzyme Inhibition Constant Data from BindingDB
Found 4 hits for monomerid = 50262119
TargetNeuromedin-U receptor 2(Mus musculus)
Takeda Pharmaceutical
Curated by ChEMBL
LigandPNGBDBM50262119(CHEMBL4097408)
Affinity DataEC50:  1.40nM. Assay description: Agonist activity at mouse NMUR2 expressed in CHO cells assessed as increase in intracellular calcium influx after 180 secs by Fluo 4-AM dye based FLI...
In DepthDetails ArticlePubMed
TargetNeuromedin-U receptor 1(Homo sapiens (Human))
Takeda Pharmaceutical
Curated by ChEMBL
LigandPNGBDBM50262119(CHEMBL4097408)
Affinity DataEC50:  32nM. Assay description: Agonist activity at human NMUR1 expressed in CHO cells assessed as increase in intracellular calcium influx after 180 secs by Fluo 4-AM dye based FLI...
In DepthDetails ArticlePubMed
TargetNeuromedin-U receptor 2(Homo sapiens (Human))
Takeda Pharmaceutical
Curated by ChEMBL
LigandPNGBDBM50262119(CHEMBL4097408)
Affinity DataEC50:  3nM. Assay description: Agonist activity at human NMUR2 expressed in CHO cells assessed as increase in intracellular calcium influx after 180 secs by Fluo 4-AM dye based FLI...
In DepthDetails ArticlePubMed
TargetNeuromedin-U receptor 1(Mus musculus)
Takeda Pharmaceutical
Curated by ChEMBL
LigandPNGBDBM50262119(CHEMBL4097408)
Affinity DataEC50:  59nM. Assay description: Agonist activity at mouse NMUR1 expressed in CHO cells assessed as increase in intracellular calcium influx after 180 secs by Fluo 4-AM dye based FLI...
In DepthDetails ArticlePubMed