BDBM50264300 CHEMBL4067018
SMILES [H][C@]12CC[C@]([H])(O1)[C@@H](C2)C(=O)N1CCC(CN2CCCN(CC2)c2c(CC)ccn3ccnc23)CC1
InChI Key InChIKey=ZUCRVTBTGIZZTG-SMIHKQSGSA-N
Data  2 KI
  Tab Delimited (TSV)   2D SDfile   Computed 3D by Vconf -m prep SDfile
Find this compound or compounds like it in BindingDB:
Activity Spreadsheet -- Enzyme Inhibition Constant Data from BindingDB
Found 2 hits for monomerid = 50264300
TargetAtypical chemokine receptor 3(Homo sapiens (Human))
Pfizer
Curated by ChEMBL
LigandPNGBDBM50264300(CHEMBL4067018)
Affinity DataKi:  760nM. Assay description: Displacement of [125I]CXCL12 from human CXCR7 expressed in CHO-K1 cell membranes after 2 hrs by scintillation counting method
In DepthDetails ArticlePubMed
TargetAtypical chemokine receptor 3(Homo sapiens (Human))
Pfizer
Curated by ChEMBL
LigandPNGBDBM50264300(CHEMBL4067018)
Affinity DataKi:  794nM. Assay description: Displacement of [125I]CXCL12 from human CXCR7 expressed in CHO-K1 cell membranes after 2 hrs by scintillation counting method
In DepthDetails ArticlePubMed