BDBM50264736 (2-morpholino-5-nitrophenyl)(4-o-tolylpiperazin-1-yl)methanone::CHEMBL488980
SMILES Cc1ccccc1N1CCN(CC1)C(=O)c1cc(ccc1N1CCOCC1)[N+]([O-])=O
InChI Key InChIKey=GRHQSFQPVYEQRJ-UHFFFAOYSA-N
Data  2 EC50
  Tab Delimited (TSV)   2D SDfile   Computed 3D by Vconf -m prep SDfile
Find this compound or compounds like it in BindingDB:
Activity Spreadsheet -- Enzyme Inhibition Constant Data from BindingDB
Found 2 hits for monomerid = 50264736
TargetSodium- and chloride-dependent glycine transporter 2(Homo sapiens (Human))
F. Hoffmann-La Roche
Curated by ChEMBL
LigandPNGBDBM50264736((2-morpholino-5-nitrophenyl)(4-o-tolylpiperazin-1-...)
Affinity DataEC50:  1.42E+4nM. Assay description: Inhibition of [3H]glycine uptake at human glycine transporter 2 expressed in CHO cells by scintillation counter
In DepthDetails ArticlePubMed
TargetSodium- and chloride-dependent glycine transporter 1(Homo sapiens (Human))
F. Hoffmann-La Roche
Curated by ChEMBL
LigandPNGBDBM50264736((2-morpholino-5-nitrophenyl)(4-o-tolylpiperazin-1-...)
Affinity DataEC50: >1.00E+4nM. Assay description: Inhibition of [3H]glycine uptake at human glycine transporter 1 expressed in CHO cells by scintillation counter
In DepthDetails ArticlePubMed