BDBM50265256 (S)-1-(2-(1,2,3,4-tetrahydroacridin-9-ylamino)ethyl)-N-(5-(1,2,3,4-tetrahydroacridin-9-ylamino)pentyl)pyrrolidine-2-carboxamide::CHEMBL451304
SMILES O=C(NCCCCCNc1c2CCCCc2nc2ccccc12)[C@@H]1CCCN1CCNc1c2CCCCc2nc2ccccc12
InChI Key InChIKey=SQVWHOMDKZAUNJ-DHUJRADRSA-N
Data  2 KI
  Tab Delimited (TSV)   2D SDfile   Computed 3D by Vconf -m prep SDfile
Find this compound or compounds like it in BindingDB:
Activity Spreadsheet -- Enzyme Inhibition Constant Data from BindingDB
Found 2 hits for monomerid = 50265256
TargetCholinesterase(Homo sapiens (Human))
European Research Centre For Drug Discovery And Development (Natsyndrugs)
Curated by ChEMBL
LigandPNGBDBM50265256((S)-1-(2-(1,2,3,4-tetrahydroacridin-9-ylamino)ethy...)
Affinity DataKi:  1.77nM. Assay description: Inhibition of human recombinant BChE
In DepthDetails ArticlePubMed
TargetAcetylcholinesterase(Homo sapiens (Human))
European Research Centre For Drug Discovery And Development (Natsyndrugs)
Curated by ChEMBL
LigandPNGBDBM50265256((S)-1-(2-(1,2,3,4-tetrahydroacridin-9-ylamino)ethy...)
Affinity DataKi:  6.75nM. Assay description: Inhibition of human recombinant AChE
In DepthDetails ArticlePubMed