BDBM50266182 CHEMBL4095639
SMILES CCCC[S+]([O-])c1sc2nc(cc(-c3cccc(c3)C(=O)NCCO)c2c1N)-c1nccs1
InChI Key InChIKey=OFKGLSDFWPKLEY-UHFFFAOYSA-N
Data  1 IC50
  Tab Delimited (TSV)   2D SDfile   Computed 3D by Vconf -m prep SDfile
Find this compound or compounds like it in BindingDB:
Activity Spreadsheet -- Enzyme Inhibition Constant Data from BindingDB
Found 1 hit for monomerid = 50266182
Target15-hydroxyprostaglandin dehydrogenase [NAD(+)](Homo sapiens (Human))
Ut Southwestern Medical Center
Curated by ChEMBL
LigandPNGBDBM50266182(CHEMBL4095639)
Affinity DataIC50:  3.40nM. Assay description: Inhibition of recombinant human C-terminal 6xHis-tagged 15-PGDH expressed in Escherichia coli using PGE2 as substrate after 15 mins in presence of NA...
In DepthDetails ArticlePubMed