BDBM50266694 CHEMBL4069307
SMILES CC[C@H](C)[C@H](NC(=O)[C@H](CC(N)=O)NC(=O)[C@H](CC(N)=O)NC(=O)[C@H](CO)NC(=O)[C@H](CO)NC(=O)[C@@H]1CCCN1C(=O)CNC(=O)CNC(=O)[C@H](CC(N)=O)NC(=O)[C@H](CCCCN)NC(=O)[C@H](CC(C)C)NC(=O)[C@H](Cc1c[nH]c2ccccc12)NC(=O)[C@H](CCC(O)=O)NC(=O)[C@@H](NC(=O)[C@H](Cc1ccccc1)NC(=O)[C@H](CC(O)=O)NC(=O)[C@H](CCC(N)=O)NC(=O)[C@H](C)NC(=O)[C@H](CCCNC(N)=N)NC(=O)[C@H](CCCNC(N)=N)NC(=O)[C@H](CO)NC(=O)[C@H](CC(O)=O)NC(=O)[C@H](CCSC)NC(=O)[C@H](CCC(N)=O)NC(=O)[C@H](CCCCN)NC(=O)[C@H](CO)NC(=O)[C@H](CC(C)C)NC(=O)[C@H](CC(O)=O)NC(=O)[C@H](CO)NC(=O)[C@@H](NC(=O)[C@H](Cc1ccccc1)NC(=O)[C@@H](NC(=O)CNC(=O)[C@H](CCC(N)=O)NC(=O)[C@H](CO)NC(=O)[C@@H](N)Cc1cnc[nH]1)[C@@H](C)O)[C@@H](C)O)[C@@H](C)CC)C(=O)N[C@@H](C)C(N)=O
InChI Key InChIKey=DQEMNHIUGLTOFP-OCMQTXBHSA-N
Data  2 EC50
  Tab Delimited (TSV)   2D SDfile   Computed 3D by Vconf -m prep SDfile
Find this compound or compounds like it in BindingDB:
Activity Spreadsheet -- Enzyme Inhibition Constant Data from BindingDB
Found 2 hits for monomerid = 50266694
TargetGlucagon receptor(Homo sapiens (Human))
Sanofi-Aventis Deutschland
Curated by ChEMBL
LigandPNGBDBM50266694(CHEMBL4069307)
Affinity DataEC50:  0.0160nM. Assay description: Agonist activity at human glucagon receptor expressed in HEK293 cells assessed as cAMP accumulation after 30 mins by HTRF assay
In DepthDetails ArticlePubMed
TargetGlucagon-like peptide 1 receptor(Homo sapiens (Human))
Sanofi-Aventis Deutschland
Curated by ChEMBL
LigandPNGBDBM50266694(CHEMBL4069307)
Affinity DataEC50:  0.0170nM. Assay description: Agonist activity at human GLP-1 receptor expressed in HEK293 cells assessed as cAMP accumulation after 30 mins by HTRF assay
In DepthDetails ArticlePubMed