BDBM50268080 (S)-5-(3-Amino-3-carboxypropylthio)-3,3-dimethylpentanoic Acid::CHEMBL488121
SMILES CC(C)(CCSCC[C@H](N)C(O)=O)CC(O)=O
InChI Key InChIKey=ULVAIGHMDAIAHL-QMMMGPOBSA-N
Data  1 IC50  1 Kd
  Tab Delimited (TSV)   2D SDfile   Computed 3D by Vconf -m prep SDfile
Find this compound or compounds like it in BindingDB:
Activity Spreadsheet -- Enzyme Inhibition Constant Data from BindingDB
Found 2 hits for monomerid = 50268080
TargetBetaine--homocysteine S-methyltransferase 1(Homo sapiens (Human))
Academy Of Sciences Of The Czech Republic
Curated by ChEMBL
LigandPNGBDBM50268080((S)-5-(3-Amino-3-carboxypropylthio)-3,3-dimethylpe...)
Affinity DataKd:  83nM. Assay description: Binding affinity to human recombinant BHMT expressed in Escherichia coli by isothermal titration calorimetry
In DepthDetails ArticlePubMed
TargetBetaine--homocysteine S-methyltransferase 1(Homo sapiens (Human))
Academy Of Sciences Of The Czech Republic
Curated by ChEMBL
LigandPNGBDBM50268080((S)-5-(3-Amino-3-carboxypropylthio)-3,3-dimethylpe...)
Affinity DataIC50:  64nM. Assay description: Inhibition of human recombinant BHMT expressed in Escherichia coli using 2 mM betaine and 1 mM DL-homocysteine as substrate
In DepthDetails ArticlePubMed