BDBM50271498 1,2-Dihydro-4-bismethanesulfonylamino-2-(4-methoxyphenyl)-1,2,4-triazolo[4,3-a]quinoxalin-1-one::CHEMBL520152
SMILES COc1ccc(cc1)-n1nc2c(nc3ccccc3n2c1=O)N(S(C)(=O)=O)S(C)(=O)=O
InChI Key InChIKey=GBCQZQVNIWDCGI-UHFFFAOYSA-N
Data  1 KI
  Tab Delimited (TSV)   2D SDfile   Computed 3D by Vconf -m prep SDfile
Find this compound or compounds like it in BindingDB:
Activity Spreadsheet -- Enzyme Inhibition Constant Data from BindingDB
Found 1 hit for monomerid = 50271498
TargetAdenosine receptor A3(Homo sapiens (Human))
Universita' Di Firenze
Curated by ChEMBL
LigandPNGBDBM50271498(1,2-Dihydro-4-bismethanesulfonylamino-2-(4-methoxy...)
Affinity DataKi:  387nM. Assay description: Displacement of [125I]AB-MECA from human cloned adenosine A3 receptor expressed in CHO cells
In DepthDetails ArticlePubMed