BDBM50271694 CHEMBL4127007
SMILES COc1cccc(C[C@H](NC(=O)c2cccc(c2)C(F)(F)F)C(=O)NCC#N)c1
InChI Key InChIKey=CUTDEYXOONYICQ-KRWDZBQOSA-N
Data  2 IC50
  Tab Delimited (TSV)   2D SDfile   Computed 3D by Vconf -m prep SDfile
Find this compound or compounds like it in BindingDB:
Activity Spreadsheet -- Enzyme Inhibition Constant Data from BindingDB
Found 2 hits for monomerid = 50271694
TargetProcathepsin L(Homo sapiens (Human))
University Of Michigan
Curated by ChEMBL
LigandPNGBDBM50271694(CHEMBL4127007)
Affinity DataIC50:  86nM. Assay description: Inhibition of human cathepsin L using Z-L-R-AMC as substrate preincubated for 5 mins followed by substrate addition measured over 5 mins by spectroph...
In DepthDetails ArticlePubMed
TargetToxopain-2(Toxoplasma gondii)
University Of Michigan
Curated by ChEMBL
LigandPNGBDBM50271694(CHEMBL4127007)
Affinity DataIC50:  6.10E+3nM. Assay description: Inhibition of Toxoplasma gondii cathepsin L using Z-L-R-AMC as substrate preincubated for 5 mins followed by substrate addition measured over 5 mins ...
In DepthDetails ArticlePubMed