BDBM50271697 CHEMBL4128244
SMILES CC(C)C[C@H](NC(=O)c1cccc(F)c1)C(=O)NCC#N
InChI Key InChIKey=RZEJBLNETBHFMH-ZDUSSCGKSA-N
Data  2 IC50
  Tab Delimited (TSV)   2D SDfile   Computed 3D by Vconf -m prep SDfile
Find this compound or compounds like it in BindingDB:
Activity Spreadsheet -- Enzyme Inhibition Constant Data from BindingDB
Found 2 hits for monomerid = 50271697
TargetProcathepsin L(Homo sapiens (Human))
University Of Michigan
Curated by ChEMBL
LigandPNGBDBM50271697(CHEMBL4128244)
Affinity DataIC50:  48nM. Assay description: Inhibition of human cathepsin L using Z-L-R-AMC as substrate preincubated for 5 mins followed by substrate addition measured over 5 mins by spectroph...
In DepthDetails ArticlePubMed
TargetToxopain-2(Toxoplasma gondii)
University Of Michigan
Curated by ChEMBL
LigandPNGBDBM50271697(CHEMBL4128244)
Affinity DataIC50:  360nM. Assay description: Inhibition of Toxoplasma gondii cathepsin L using Z-L-R-AMC as substrate preincubated for 5 mins followed by substrate addition measured over 5 mins ...
In DepthDetails ArticlePubMed