BDBM50278314 CHEMBL1076628::sodium perosmate(VIII)
SMILES [O-][Os]([O-])(=O)(=O)=O
InChI Key InChIKey=OCNNBYRXULLCFR-UHFFFAOYSA-N
Data  14 KI
  Tab Delimited (TSV)   2D SDfile   Computed 3D by Vconf -m prep SDfile
Find this compound or compounds like it in BindingDB:
Activity Spreadsheet -- Enzyme Inhibition Constant Data from BindingDB
Found 14 hits for monomerid = 50278314
TargetAlpha-carbonic anhydrase(Helicobacter pylori)
Universit?? Degli Studi Di Firenze
LigandPNGBDBM50278314(CHEMBL1076628 | sodium perosmate(VIII))
Affinity DataKi:  4.80E+5nM ΔG°:  -4.52kcal/molepH: 7.5 T: 2°C. Assay description: An Applied Photophysics stopped-flow instrument has been used for assaying the CA catalysed CO2 hydration activity Khalifah RG. The carbon dioxide hy...
Ligand InfoCHEMBLPC sid
In DepthDetails ArticlePubMed
TargetCarbonic anhydrase(Astrosclera willeyana)
Slovak Academy Of Sciences
Curated by ChEMBL
LigandPNGBDBM50278314(CHEMBL1076628 | sodium perosmate(VIII))
Affinity DataKi:  6.90E+5nM. Assay description: Inhibition of Astrosclera willeyana recombinant GST-tagged astrosclerin 3 expressed in Escherichia coli BL21-DE3-RIPL cells preincubated for 15 mins ...
Ligand InfoCHEMBLPC sid
In DepthDetails ArticlePubMed
TargetCarbonic anhydrase(Helicobacter pylori)
Universit?? Degli Studi Di Firenze
LigandPNGBDBM50278314(CHEMBL1076628 | sodium perosmate(VIII))
Affinity DataKi:  8.90E+5nM ΔG°:  -4.16kcal/molepH: 7.5 T: 2°C. Assay description: An Applied Photophysics stopped-flow instrument has been used for assaying the CA catalysed CO2 hydration activity Khalifah RG. The carbon dioxide hy...
Ligand InfoCHEMBLPC sid
In DepthDetails ArticlePubMed
TargetCarbonic anhydrase 1(Homo sapiens (Human))
Universit£
Curated by ChEMBL
LigandPNGBDBM50278314(CHEMBL1076628 | sodium perosmate(VIII))
Affinity DataKi:  9.20E+5nMpH: 8.3Assay Description:Inhibition of recombinant human carbonic anhydrase 1 after 15 mins by stopped flow CO2 hydration assay at pH 8.3
Ligand InfoCHEMBLPC sid
In DepthDetails ArticlePubMed
TargetCarbonic anhydrase 1(Homo sapiens (Human))
Universit£
Curated by ChEMBL
LigandPNGBDBM50278314(CHEMBL1076628 | sodium perosmate(VIII))
Affinity DataKi:  9.20E+5nM. Assay description: Inhibition of human carbonic anhydrase 1 after 15 mins by stopped flow CO2 hydration assay
Ligand InfoCHEMBLPC sid
In DepthDetails ArticlePubMed
TargetCarbonic anhydrase 1(Homo sapiens (Human))
Universit£
Curated by ChEMBL
LigandPNGBDBM50278314(CHEMBL1076628 | sodium perosmate(VIII))
Affinity DataKi:  9.20E+5nM. Assay description: Inhibition of human recombinant carbonic anhydrase 1 by stopped flow CO2 hydration assay
Ligand InfoCHEMBLPC sid
In DepthDetails ArticlePubMed
TargetCarbonic anhydrase 1(Homo sapiens (Human))
Universit£
Curated by ChEMBL
LigandPNGBDBM50278314(CHEMBL1076628 | sodium perosmate(VIII))
Affinity DataKi:  9.20E+5nM. Assay description: Inhibition of human recombinant carbonic anhydrase 1-catalyzed CO2 hydration by stopped flow assay
Ligand InfoCHEMBLPC sid
In DepthDetails ArticlePubMed
TargetCarbonic anhydrase 2(Homo sapiens (Human))
Slovak Academy Of Sciences
Curated by ChEMBL
LigandPNGBDBM50278314(CHEMBL1076628 | sodium perosmate(VIII))
Affinity DataKi:  9.50E+5nM. Assay description: Inhibition of human recombinant carbonic anhydrase 2 by stopped flow CO2 hydration assay
Ligand InfoCHEMBLPC sid
In DepthDetails ArticlePubMed
TargetCarbonic anhydrase 2(Homo sapiens (Human))
Slovak Academy Of Sciences
Curated by ChEMBL
LigandPNGBDBM50278314(CHEMBL1076628 | sodium perosmate(VIII))
Affinity DataKi:  9.50E+5nM. Assay description: Inhibition of human carbonic anhydrase 2 after 15 mins by stopped flow CO2 hydration assay
Ligand InfoCHEMBLPC sid
In DepthDetails ArticlePubMed
TargetCarbonic anhydrase 2(Homo sapiens (Human))
Slovak Academy Of Sciences
Curated by ChEMBL
LigandPNGBDBM50278314(CHEMBL1076628 | sodium perosmate(VIII))
Affinity DataKi:  9.50E+5nM. Assay description: Inhibition of human recombinant carbonic anhydrase 2-catalyzed CO2 hydration by stopped flow assay
Ligand InfoCHEMBLPC sid
In DepthDetails ArticlePubMed
TargetCarbonic anhydrase 2(Homo sapiens (Human))
Slovak Academy Of Sciences
Curated by ChEMBL
LigandPNGBDBM50278314(CHEMBL1076628 | sodium perosmate(VIII))
Affinity DataKi:  9.50E+5nMpH: 8.3Assay Description:Inhibition of recombinant human carbonic anhydrase 2 after 15 mins by stopped flow CO2 hydration assay at pH 8.3
Ligand InfoCHEMBLPC sid
In DepthDetails ArticlePubMed
TargetCarbonic anhydrase 13(Mus musculus (mouse))
Universit£
Curated by ChEMBL
LigandPNGBDBM50278314(CHEMBL1076628 | sodium perosmate(VIII))
Affinity DataKi:  9.60E+5nM. Assay description: Inhibition of mouse recombinant carbonic anhydrase 13-catalyzed CO2 hydration by stopped flow assay
Ligand InfoCHEMBLPC sid
In DepthDetails ArticlePubMed
TargetCarbonic anhydrase 7(Homo sapiens (Human))
Universit£
Curated by ChEMBL
LigandPNGBDBM50278314(CHEMBL1076628 | sodium perosmate(VIII))
Affinity DataKi:  1.02E+6nM. Assay description: Inhibition of human recombinant carbonic anhydrase 7-catalyzed CO2 hydration by stopped flow assay
Ligand InfoCHEMBLPC sid
In DepthDetails ArticlePubMed
TargetCarbonic anhydrase 4(Homo sapiens (Human))
Universit£
Curated by ChEMBL
LigandPNGBDBM50278314(CHEMBL1076628 | sodium perosmate(VIII))
Affinity DataKi:  1.06E+6nM. Assay description: Inhibition of human recombinant carbonic anhydrase 4-catalyzed CO2 hydration by stopped flow assay
Ligand InfoCHEMBLPC sid
In DepthDetails ArticlePubMed