BDBM50278677 CHEMBL4162566
SMILES OC(=O)CCc1ccc(OCc2c(nsc2C(F)(F)F)-c2ccc(Cl)cc2)c(Br)c1
InChI Key InChIKey=ZPVLUCQOVXXJPI-UHFFFAOYSA-N
Data  2 EC50
  Tab Delimited (TSV)   2D SDfile   Computed 3D by Vconf -m prep SDfile
Find this compound or compounds like it in BindingDB:
Activity Spreadsheet -- Enzyme Inhibition Constant Data from BindingDB
Found 2 hits for monomerid = 50278677
TargetFree fatty acid receptor 4(Homo sapiens (Human))
Janssen Research And Development
Curated by ChEMBL
LigandPNGBDBM50278677(CHEMBL4162566)
Affinity DataEC50:  83nM. Assay description: Agonist activity at PK-tagged human GPR120 long isoform expressed in CHOK1 cells co-expressing EA-tagged beta-arrestin assessed as beta-gal enzyme co...
In DepthDetails ArticlePubMed
TargetFree fatty acid receptor 4(Homo sapiens (Human))
Janssen Research And Development
Curated by ChEMBL
LigandPNGBDBM50278677(CHEMBL4162566)
Affinity DataEC50:  31nM. Assay description: Agonist activity at human GPR120 short splice variant expressed in HEK293 cells assessed as increase in intracellular calcium flux incubated for 30 m...
In DepthDetails ArticlePubMed