BDBM50278738 CHEMBL4162555
SMILES COc1nc(Cl)cnc1NS(=O)(=O)c1cccc(F)c1Cl
InChI Key InChIKey=GKCQCYDQKNZYMS-UHFFFAOYSA-N
Data  1 IC50
  Tab Delimited (TSV)   2D SDfile   Computed 3D by Vconf -m prep SDfile
Find this compound or compounds like it in BindingDB:
Activity Spreadsheet -- Enzyme Inhibition Constant Data from BindingDB
Found 1 hit for monomerid = 50278738
TargetC-C chemokine receptor type 4(Homo sapiens (Human))
Astrazeneca
Curated by ChEMBL
LigandPNGBDBM50278738(CHEMBL4162555)
Affinity DataIC50:  16nM. Assay description: Antagonist activity at recombinant human CCR4 expressed in CHO-K1 cells assessed as inhibition of CCL22 induced Ca2+ mobilization after 2 hrs by FMAT...
In DepthDetails ArticlePubMed