BDBM50279763 CHEMBL4162308
SMILES NS(=O)(=O)c1ccc(s1)-c1ncc(Cl)c(Nc2cc([nH]n2)C2CC2)n1
InChI Key InChIKey=KRMDPWLIHGQVGZ-UHFFFAOYSA-N
Data  3 KI
PDB links: 2 PDB IDs match this monomer.
  Tab Delimited (TSV)   2D SDfile   Computed 3D by Vconf -m prep SDfile
Find this compound or compounds like it in BindingDB:
Activity Spreadsheet -- Enzyme Inhibition Constant Data from BindingDB
Found 3 hits for monomerid = 50279763
TargetSerine/threonine-protein kinase PknB(Mycobacterium tuberculosis)
Vertex Pharmaceuticals
Curated by ChEMBL
LigandPNGBDBM50279763(CHEMBL4162308)
Affinity DataKi: <1.30nM. Assay description: Inhibition of Mycobacterium tuberculosis PknB (M1 to G279 residues) expressed in Escherichia coli BL21 (DE3) cells using [T-33P]ATP as substrate afte...
TargetSerine/threonine-protein kinase PknA(Mycobacterium tuberculosis (strain ATCC 25618 / H3...)
Vertex Pharmaceuticals
Curated by ChEMBL
LigandPNGBDBM50279763(CHEMBL4162308)
Affinity DataKi:  9nM. Assay description: Inhibition of Mycobacterium tuberculosis PknA (M1 to A296 residues) expressed in Escherichia coli BL21 (DE3) pLysS cells using [T-33P]ATP as substrat...
TargetCyclin-A2/Cyclin-dependent kinase 2(Homo sapiens (Human))
Vertex Pharmaceuticals
Curated by ChEMBL
LigandPNGBDBM50279763(CHEMBL4162308)
Affinity DataKi:  17nM. Assay description: Inhibition of hog kidney renin at 10e-9 M concentration
In DepthDetails ArticlePubMed