BDBM50280563 1-Aza-bicyclo[2.2.1]heptan-3-one O-(4-methoxy-but-2-ynyl)-oxime::CHEMBL168991
SMILES COCC#CCO\N=C1/CN2CCC1C2
InChI Key InChIKey=ANTVCMHSNDCZOH-VAWYXSNFSA-N
Data  3 IC50
  Tab Delimited (TSV)   2D SDfile   Computed 3D by Vconf -m prep SDfile
Find this compound or compounds like it in BindingDB:
Activity Spreadsheet -- Enzyme Inhibition Constant Data from BindingDB
Found 3 hits for monomerid = 50280563
TargetMuscarinic acetylcholine receptor M2(Homo sapiens (Human))
TBA
Curated by ChEMBL
LigandPNGBDBM50280563(1-Aza-bicyclo[2.2.1]heptan-3-one O-(4-methoxy-but-...)
Affinity DataIC50:  5.93E+4nM. Assay description: Inhibitory activity against human Muscarinic acetylcholine receptor M2 using [3H]-quinuclidinyl benzilate to label antagonist site (RQNB) in CHO cell...
In DepthDetails Article
LigandPNGBDBM50280563(1-Aza-bicyclo[2.2.1]heptan-3-one O-(4-methoxy-but-...)
Affinity DataIC50:  55nM. Assay description: Compound was evaluated for inhibition of [3H]cis-methyldioxolane binding to label agonist sites (RCMD) in rat neocortex
In DepthDetails Article
TargetMuscarinic acetylcholine receptor M1(Homo sapiens (Human))
TBA
Curated by ChEMBL
LigandPNGBDBM50280563(1-Aza-bicyclo[2.2.1]heptan-3-one O-(4-methoxy-but-...)
Affinity DataIC50:  4.24E+4nM. Assay description: Inhibitory activity against human Muscarinic acetylcholine receptor M1 using [3H]-quinuclidinyl benzilate to label antagonist site (RQNB) in CHO cell...
In DepthDetails Article