BDBM50280568 1-Aza-bicyclo[2.2.1]heptan-3-one O-but-3-ynyl-oxime::CHEMBL352832
SMILES C#CCCO\N=C1/CN2CCC1C2
InChI Key InChIKey=IYTIRJKFPPCZDQ-ZHACJKMWSA-N
Data  3 IC50
  Tab Delimited (TSV)   2D SDfile   Computed 3D by Vconf -m prep SDfile
Find this compound or compounds like it in BindingDB:
Activity Spreadsheet -- Enzyme Inhibition Constant Data from BindingDB
Found 3 hits for monomerid = 50280568
TargetMuscarinic acetylcholine receptor M1(Homo sapiens (Human))
TBA
Curated by ChEMBL
LigandPNGBDBM50280568(1-Aza-bicyclo[2.2.1]heptan-3-one O-but-3-ynyl-oxim...)
Affinity DataIC50:  1.45E+4nM. Assay description: Inhibitory activity against human Muscarinic acetylcholine receptor M1 using [3H]-quinuclidinyl benzilate to label antagonist site (RQNB) in CHO cell...
In DepthDetails Article
LigandPNGBDBM50280568(1-Aza-bicyclo[2.2.1]heptan-3-one O-but-3-ynyl-oxim...)
Affinity DataIC50:  83nM. Assay description: Inhibitory activity against human Muscarinic acetylcholine receptor M1 using [3H]-quinuclidinyl benzilate to label antagonist site (RQNB) in CHO cell...
In DepthDetails Article
TargetMuscarinic acetylcholine receptor M2(Homo sapiens (Human))
TBA
Curated by ChEMBL
LigandPNGBDBM50280568(1-Aza-bicyclo[2.2.1]heptan-3-one O-but-3-ynyl-oxim...)
Affinity DataIC50:  1.56E+4nM. Assay description: Inhibitory activity against human Muscarinic acetylcholine receptor M2 using [3H]-quinuclidinyl benzilate to label antagonist site (RQNB) in CHO cell...
In DepthDetails Article