BDBM50280751 CHEMBL4174397
SMILES COc1ccc(\C=C2/CC(CO)(COC(=O)c3ccc(Cl)cc3)OC2=O)cc1
InChI Key InChIKey=KQEBVHBFIFTJGM-MHWRWJLKSA-N
Data  3 KI
  Tab Delimited (TSV)   2D SDfile   Computed 3D by Vconf -m prep SDfile
Find this compound or compounds like it in BindingDB:
Activity Spreadsheet -- Enzyme Inhibition Constant Data from BindingDB
Found 3 hits for monomerid = 50280751
TargetRas guanyl-releasing protein 3(Homo sapiens (Human))
Seoul National University
Curated by ChEMBL
LigandPNGBDBM50280751(CHEMBL4174397)
Affinity DataKi:  1.5nM. Assay description: Displacement of [3H]PDBu from full length MBP-tagged human RasGRP3 expressed in Escherichia coli BL21 (DE3) after 5 mins by scintillation counting
In DepthDetails ArticlePubMed
TargetProtein kinase C epsilon type(Homo sapiens (Human))
Seoul National University
Curated by ChEMBL
LigandPNGBDBM50280751(CHEMBL4174397)
Affinity DataKi:  6.80nM. Assay description: Displacement of [3H]PDBu from full length recombinant human PKCepsilon expressed in baculovirus expression system after 5 mins by scintillation count...
In DepthDetails ArticlePubMed
TargetProtein kinase C alpha type(Homo sapiens (Human))
Seoul National University
Curated by ChEMBL
LigandPNGBDBM50280751(CHEMBL4174397)
Affinity DataKi:  30nM. Assay description: Displacement of [3H]PDBu from full length recombinant human PKCalpha expressed in baculovirus expression system after 5 mins by scintillation countin...
In DepthDetails ArticlePubMed