BDBM50281176 (S)-2-Mercaptomethyl-3-phenyl-propionic acid::2-THIOMETHYL-3-PHENYLPROPANOIC ACID::CHEMBL90403
SMILES OC(=O)[C@@H](CS)Cc1ccccc1
InChI Key InChIKey=ZUEBVBPVXLQMQR-SECBINFHSA-N
Data  1 KI
  Tab Delimited (TSV)   2D SDfile   Computed 3D by Vconf -m prep SDfile
Find this compound or compounds like it in BindingDB:
Activity Spreadsheet -- Enzyme Inhibition Constant Data from BindingDB
Found 1 hit for monomerid = 50281176
TargetMast cell carboxypeptidase A(Homo sapiens (Human))
TBA
Curated by ChEMBL
LigandPNGBDBM50281176((S)-2-Mercaptomethyl-3-phenyl-propionic acid | 2-T...)
Affinity DataKi:  7.80nM. Assay description: Compound was tested for inhibitory activity against carboxypeptidase A
In DepthDetails Article