BDBM50281768 CHEMBL176588::Thiophene-3-carboxylic acid [2-(3,4-dichloro-phenyl)-4-(4-hydroxy-4-phenyl-piperidin-1-yl)-butyl]-methyl-amide
SMILES CN(CC(CCN1CCC(O)(CC1)c1ccccc1)c1ccc(Cl)c(Cl)c1)C(=O)c1ccsc1
InChI Key InChIKey=ZQXTYFUVNQBWKC-UHFFFAOYSA-N
Data  1 KI
  Tab Delimited (TSV)   2D SDfile   Computed 3D by Vconf -m prep SDfile
Find this compound or compounds like it in BindingDB:
Activity Spreadsheet -- Enzyme Inhibition Constant Data from BindingDB
Found 1 hit for monomerid = 50281768
TargetSubstance-K receptor(Rattus norvegicus (Rat))
TBA
Curated by ChEMBL
LigandPNGBDBM50281768(CHEMBL176588 | Thiophene-3-carboxylic acid [2-(3,4...)
Affinity DataKi:  1nM. Assay description: Inhibition of [125I]-NKA binding to neurokinin NK2 receptor from rat duodenum membranes
In DepthDetails Article