BDBM50281774 CHEMBL366382::N-[4-(4-Acetylamino-4-phenyl-piperidin-1-yl)-2-(3,4-dichloro-phenyl)-butyl]-benzamide
SMILES CC(=O)NC1(CCN(CCC(CNC(=O)c2ccccc2)c2ccc(Cl)c(Cl)c2)CC1)c1ccccc1
InChI Key InChIKey=YJNZRHCZFWPFOF-UHFFFAOYSA-N
Data  1 KI
  Tab Delimited (TSV)   2D SDfile   Computed 3D by Vconf -m prep SDfile
Find this compound or compounds like it in BindingDB:
Activity Spreadsheet -- Enzyme Inhibition Constant Data from BindingDB
Found 1 hit for monomerid = 50281774
TargetSubstance-K receptor(Rattus norvegicus (Rat))
TBA
Curated by ChEMBL
LigandPNGBDBM50281774(CHEMBL366382 | N-[4-(4-Acetylamino-4-phenyl-piperi...)
Affinity DataKi: >100nM. Assay description: Inhibition of [125I]-NKA binding to neurokinin NK2 receptor from rat duodenum membranes
In DepthDetails Article